xcode-select --install. This command prompts with a popup, click on the install button and proceed with the installation. It takes some time to download and install the Xcode command-line tools. Once you are successfully installed, you can now download new npm packages without any (gyp) error...Search form submit button. Toggle Search; Command phasescriptexecution failed with a nonzero exit code xcode 12

diff -urN mutt-0.91.2/ChangeLog mutt-0.93/ChangeLog --- mutt-0.91.2/ChangeLog Sat Jun 27 00:28:04 1998 +++ mutt-0.93/ChangeLog Fri Jul 10 11:49:42 1998 @@ -1307,3 +1307,624 @@ the case where a date rolled over to the previous year when selecting by number of months in the past +Changes since 0.91 +----- + +- fixed bug in rfc822_parse_adrlist() where it would segfault on a bad address + which ... How to Install Xcode Command Line Tools. By using this command, you can download and install the latest Xcode command-line tools. Code samples are licensed under the MIT License. Advertising Disclosure: This site may be compensated in exchange for featured placement of certain...

Freelance xactimate estimators
Tls tunnel files for telkom
Lawn boy 66 7460
The mean of the following distribution is 48
"Program 1440x900 failed with exit code 5". If I copy the app to the client and run the above cmd line it works fine. I have also made a batch file with the above command line and tried running that from the ccm cache after it has failed and that works too.URL:https://developer.apple.com/documentation/xcode_release_notes/xcode_10_release_notes/swift_4_2_release_notes_for_xcode_10.
nonzero failed exit compileswiftsources command code xcode compileswift download not ios - Changing an imported library using cocoapods I am working on a project using cocoapods and suddenly I see myself doing some changes in one of the libraries. Please install expo-cli command Command PhaseScriptExecution failed with a nonzero exit code. I am pretty sure I have expo-cli installed. The build still failed, with the exam same error message. I checked that the iOS release is at 2.8.3, and Expo SDK is at 30.0.1. I am using xcode 10 and build...
[Tip] Xcode 10: “Command PhaseScriptExecution failed with a nonzero exit code” on “${PODS_ROOT}/S... 在 Xcode 10.1 中安装一些老项目的 pods 时,会出现编译失败的情况,尝试手动清理总是不彻底,一个有效的解决方式是安装 pods 清理工具,然后清理项目中 pods 的关联后,再 重新 pod install Bloon tower defense 5 strategy
May 13, 2019 · MacOS: 10.13.6 Xcode: 10.1 ITK: ITK 5.0 Release Candidate 2. Error:! Apple Mach-O Linder(id) Error!Linker command failed with exit code 1(use -v to see invocation) detail: ld: library not found for -litkdouble-conversion clang: error: linker command failed with exit code 1 (use -v to see invocation) Can someone help me this? Nov 05, 2007 · To view the output of a command line program in XCode, you have to open the console. The quickest way to do this is to have the main source code file open, and click the console button that appears towards the top after you click "Build-And-Go."
So I'm having trouble with a Rez error preventing AU compilation. Code: /Volumes/Data/Programming/IPlug-Youlean-master/WDL/IPlug/IPlugAU.r:102: ### /Applications/Xcode.app/Contents/Developer/usr/bin/Rez - Expected string, but...Nov 01, 2010 · These are all the actions Xcode takes when it builds your app. CocoaPods inserts a bunch of crap into this list. It’s probably fine to leave those for now, but one of the items in the list should be a shell scrip that references SwiftLint.
Sep 23, 2019 · J'essaye de recompiler un petit programme via XCODE 11 or il "bugue" avec ce message : "Command CodeSign failed with a nonzero exit code" Cependant, il compile correctement et me permet de lancer l'exécutable hors Xcode. The command “yarn build” fail each time without so much information. Failed to open a session for the virtual machine. clang: error: linker command failed with exit code 1 (use -v to see invocation).
Command /bin/sh failed with exit code 1. ... high sierra xcode 9 codesign failed with exit code 1. ... 【已解决】Xcode9.2编译出错:ld library not found for ... ld: 2 duplicate symbols for architecture i386. clang: error: linker command failed with exit code 1 (use -v to see invocation) 原因 iOS开发这个错误一定少不了,现总结如下,一般这三方面的问题,如果不是哪你真可麻烦了. 1.引用出错,把***.h弄成了.m,检查一下你的所有引用;
Feb 02, 2012 · I'm trying to build code in Xcode, but I keep getting the following error: xcodebuild[17565:903] Unexpected character / at line 1 xcodebuild: error: Unable to read project 'VTK.xcodeproj'. Reason: Project ../VTK.xcodeproj cannot be opened because the project file cannot be parsed. make... Apr 03, 2019 · Attempt made so far: Go to Xcode > Build Phase > Add Run script shell: #!/usr/bin/swift sh let x = 10 When I run I get the following error let: =: syntax error: operand expected (error token is "=") Command PhaseScriptExecution failed with a nonzero exit code Questions: Could you assist me to create a build script (like x=10, just a proof of concept) Is the hashbang used correct and am I supposed to u...
3、如果在真机中进行测试时出现failed to get the task for process,有可能是证书出了问题。 4、如果出现expect a type的错误,可能出现了在.h文件中的循环引用。 5、以后不能同时有两个一样的.m文件在编译,这样会报linker command failed with exit code 1 (use -vto see invocation)这个 ... Search form submit button. Toggle Search; Command phasescriptexecution failed with a nonzero exit code xcode 12
Jun 01, 2020 · Buildozer. Buildozer is a tool for creating application packages easily. The goal is to have one "buildozer.spec" file in your app directory, describing your application requirements and settings such as title, icon, included modules etc. Buildozer will use that spec to create a package for Android, iOS, Windows, OSX and/or Linux. May 29, 2019 · clang: error: linker command failed with exit code 1 (use -v to see invocation) cameron-fmod June 3, 2019, 4:54am #2 What version of FMOD are you using?
The full message is: Last Command: git fetch origin Status: Failed Error: git failed with exit code 128 Permission denied, please try again. Permission denied, please try again. [email protected]: Permission denied (publickey, password). fatal: Could not read...The terminal exited with code 1 on Windows 10 (with WSL as the default shell). This can happen if Windows Subsystem for Linux (WSL) is not set up with a valid default Linux distribution. Error "ConnectNamedPipe failed: Windows error 232".
Command CodeSign failed with a nonzero exit code (Something.framework) ごみDDコンテンツ; rm -rf / Users / dx / Library / Developer / Xcode / DerivedData / * XCodeを再起動します; ビルドフェーズ=> Link Binary With Libraries. Something.framework、 埋め込み値を設定 General => Something.framework => EMBED. Do not embed DDUXJ~€I"€@ ZìMgic @ !œ$ ( -.0¬4Ž8 à 2ÿù !« « , Iöˆ( ÇL ] ‡ „ ¤$ $ È ] [email protected]( Uÿÿ ] ‡ „ ¤$ @. ] } ‡ RunNumberArrayHiers ?ÿ ...
Given this is a libgdx usage of robovm with the admob robovm-ios-bindings, my build.gradle includes all the jars in the libs directory which contains the admob.jar (the libgdx version of the admob robovm-ios-bindings that contains the libadmob.a and the stub of a robovm.xml) and somehow this gets expanded into the .robovm cache in both the thumv7 directory and the arm64 directory, and they ... บริษัท เก้ายอดสตูดิโอ จำกัด Kaoyod Studio Co.,Ltd. We Are Digital Production House. ~ iOS Dev, Android Dev, Web Dev, Responsive Web Design, HTML5 Tel : 02–274–8818 Email : [email protected]
Linker Command failed with exit code 1 1.当xcode编译出现这种错误提示的时候,右击问题-->Reveal in Log 查看详细的错误信息 2.通过log可以看到错误原因是:ld: library not found for -lstdc++.6.0.9 3.出现这种错误的原因是: 苹果在XCode10和iOS12中移除了libstdc++这个库,由libc++这个库 ... I am trying to learn how to build for iOS, but am running into complete blocks with Xcode. Just trying to run a simple black box "game" that doesn't have any movement, build fails in Xcode. I run into two problems: Error: Command CodeSign failed with a nonzero exit code warning: User supplied...
I'm using TeamCity and launch XCode with a command line. IkerG_Anino. Nov 05, 2020 07:24. ... Command PhaseScriptExecution failed with a nonzero exit code" tbg10101_ Hi, I have build my Unity iOS project with Unity 5.3.1 and opened in Xcode 7.1.1. My build is failed with this error : command /bin/sh failed with exit code 126. [ MapFileParser.sh: Permission Denied] Command PhaseScriptExecution failed with a nonzero exit code.
Command /usr/bin/codesign failed with exit code 1 에러 해결 (2) 2017.12.06: 왕초보를 위한 <Reactive programming이 뭔지 알기 전에> (11) 2017.11.24: Xcode ) Playground에 3rd party framework 추가하는 방법 (6) 2017.11.22: Xcode ) 프로젝트 소스파일. 폴더로 정리하기 (0) 2017.11.20 Oct 01, 2020 · Run with --info or --debug option to get more log output. Run with --scan to get full insights. * Get more help at https://help.gradle.org BUILD FAILED in 1m 10s Exception: Gradle task assembleDebug failed with exit code 1 flutter doctor:
Ubuntu Forums Code of Conduct. i am trying to install ubuntu on a Dell 9150 with 2 gig of memory and Pentium D processor i get to the Preparing to install screen and check the install updates and then press continue i then get a ubi-partman fail with exit code 10.Command /Xcode.app/Contents/Developer/Toolchains/XcodeDefault.xctoolchain/usr/bin/clang failed with exit code 1. I'm trying to do an application reading pdf using pdf kit in Xcode 4.3 but it gives me the following error. ld: duplicate symbol _OBJC_METACLASS_$_OverlayManager in...
Pastebin.com is the number one paste tool since 2002. Pastebin is a website where you can store text online for a set period of time. clang: error: linker command failed with exit code 1 (use -v to see invocation) And with the -v option tagged on the end: Apple LLVM version 5.1 (clang-503.0.38) (based on LLVM 3.4svn)
Pressing command key (⌘) with R key make Xcode run code into simulator. 2. Zoom in-Out :- (Alt and drag) For zoom in and zoom out in both cases you have to press first alt key or you can say option key in Mac keyboard after holding alt key you will see two dots according to your cursor point and if you drag your cursor outward then it will ... PR here that fixes this issue for me: https://github.com/macports/macports-ports/pull/9146
Pods-{apptitle}-frameworks.sh: Permission denied Command PhaseScriptExecution failed with a nonzero exit code 試したこと. クリーンビルド XCODEの再起動 Podfileのアップデート、再インストール キーチェーンアクセス(ログイン)のロック・解除 . ターミナルよりアクセス許可? This is a Swift compiler bug, apparently testing for two or more implicitly unwrapped optionals causes the compiler to crash under some/many Command PhaseScriptExecution failed with a nonzero exit code - No such file or directory Hot Network Questions Sorting an object by value w/ `sort` and `reduce`
0x2 ld未知参数-platform_version $ clang hello.c -o hello ld: unknown option: -platform_version clang- 10 : error: linker command failed with exit code 1 (use -v to see invocation) 这个问题主要在于macOS Catalina系统中已经不再使用 -platform_version 参数,但llvm编译时还会继续往 ld 参数里添加 -platform_version ... La commande CompileSwift a échoué avec un code de sortie non nul en Xcode 10 bonjour, après mise à jour vers la dernière version de Xcode pour le moment (version 10.0) le projet n'est pas en mesure de construire car il a trouvé des erreurs concernant certaines "commande CompileSwift échoué avec un code de sortie non nul" erreur.
Command PhaseScriptExecution failed with a nonzero exit code (1) 2020.04.26: AttributeError: module 'tensorflow' has no attribute 'set_random_seed' (0) 2020.04.16: Verify developer APP certificate문제 (0) 2020.04.10: 이미지뷰에 Tap Gesture Recognizer가 인식되지 않는 현상 (0) 2020.04.06 Lorsque vous développez une application iOS avec Xcode et que vous souhaitez la compiler, le compilateur Linker peut afficher un message d'erreur Il s'agit du message "Linker command failed with exit code 1". Il existe une méthode pour obtenir davantage d'informations pour aider à résoudre...
Thank you for ordering the DA14585 Multisensor IOT kit and thanks for your question. The latest version of the source code of the IoT iOS mobile application which is available in our support portal, is version 3.260.10. If you are working on this version, the code was compiled in XCODE 9.4.1. Thanks, PM_Dialog Я получаю "Command/usr/bin/codesign failed with exit code 1". В XCode зайдите в Настройки. Нажмите на вкладку Местоположения. В командной строке выберите из выпадающего XCode 10.1.
Automatically signing iOS for device deployment using specified development team in Xcode project: MD4 Running Xcode build... Xcode build done. 10.2s Failed to build ...
How to make steel blightfall
Pulse secure proxy settings
Stimulus check 2 updates
1944 d s 20 centavos
Pack rifle review

Mar 18, 2020 · Hi there, I have just downloaded RStudio and installed the two packages clang.7.0.0 and gfortran-6.1.pkg on my Mac (iOS Catalina) 10.15. However, when trying to install any further package in RStudio I seem to run into &hellip; Fullscreen/Exit Fullscreen f. Mute/Unmute m. Displayed on accounts with a poison ban. This error occurs because the site tries to redirect to the Membership/CreationDisabled.aspx page, but when banned, all pages redirect back to Membership/NotApproved.aspx, creating an infinite redirect loop.

diff -urN mutt-0.91.2i/ChangeLog mutt-0.93i/ChangeLog --- mutt-0.91.2i/ChangeLog Wed Apr 15 10:08:12 1998 +++ mutt-0.93i/ChangeLog Fri Jul 10 11:41:02 1998 @@ -1307,3 +1307,624 @@ the case where a date rolled over to the previous year when selecting by number of months in the past +Changes since 0.91 +----- + +- fixed bug in rfc822_parse_adrlist() where it would segfault on a bad address ... If you also get code signing fails with the error "resource fork, Finder information, or similar detritus not allowed." Run script below in console to fix Hopefully, this will help someone who is having the same "Command CodeSign failed with a nonzero exit code" error....10 beta: Command CompileSwiftSources failed with a nonzero exit code Here is the full invocation: CompileSwiftSources normal arm64 com.apple.xcode.tools.swift.compiler Join GitHub today. GitHub is home to over 50 million developers working together to host and review code, manage projects...Bugzilla – Bug 57068 Error: linker command failed with exit code 1 Last modified: 2017-06-08 08:47:46 UTC Bug 57068 - Error: linker command failed with exit code 1 Summary: Error: linker command failed with exit code 1 Groovy Installation - "Failed to process package 'tf2_ros'" in "catkin_make_isolated" - MacBook OSX CodeBlocks. 15.10 Wily Werewolf.

Correction of 5679. drkns 18.10.2020 23:32:51 +0100 - build 5679 1. gh-269: Apply variables to subsequent lines as well. drkns 12.10.2020 08:40:27 +0100 - build 5678 1. Correction of 5677. drkns 12.10.2020 00:12:45 +0100 - build 5677 1. Refactoring. 2. As it turns out, gnu ld maps are useless for stack tracing, so now objdump output is used ... I work with Win 10 and this it's a build failed to iOS application file I have update a Intel XDK to build 3240, so I have converted my previous App to Android build and I have update all plugins. I read some replay to other tickets (same this error) and I Removing Intel® XDK Local Data on Windows 10 but the...not found for architecture x86_64 clang: error: linker command failed with exit code 1 (use -v to see invocation) 今天在编译微信的Demo的时候报错,肯定是运行不了的,报错如题,在网上找到了答案... xcode报错:Undefined symbols for architecture x86_64 nonzero failed exit compileswiftsources command code xcode compileswift download not ios - Changing an imported library using cocoapods I am working on a project using cocoapods and suddenly I see myself doing some changes in one of the libraries. When I build the framework, the command Ld failed with a nonzero exit code error appears. The error description is clang: error: invalid argument '-compatibility_version 1' only To solve this problem, we have implemented measures to analyze the source code and how to write the source code.방정식 2 ⋅ x = 10 2 ⋅ x = 10 의 근을 Gradient Descent를 이용해서 찾아보자. 4월 25, 2017. I met this error when i build old source code. I searched google and find a lot solutions but it is case by case. 6. Test it ( from command prompt : import cv2 ) < Install opencv to anaconda : Method 2> 1. Run spyder...

踩坑Xcode 10之New Build System. Xcode10 Version 10.0 (10A255)发布,笔者第一时间升级。很显然使用的过程中出现了不少问题,相信大家都有所耳闻,最典型的就是libstdc++.6.0.9问题,网上已经有不少方法了,这里就不多说了。

Xcode编译常见错误解决:linker command failed with exit code 1 (use -v to see invocation) Showing All Issues clang: error: linker command failed with exit code 1 (use -v to see invocation)出现以上错误,现总结如下解决方法: 1 、检查引用文件是否出错,把 xxx.h文件弄成了xxx.m文件,检查一下你的...

ld: symbol(s) not found for architecture armv7 clang: error: linker command failed with exit code 1 (use -v to see invocation) linker command failed with exit code と言われているようなので、 TARGET - Build Phases の中の Link Binary With Libraries に必要なフレームワークが入っているかを確認したら ... Given this is a libgdx usage of robovm with the admob robovm-ios-bindings, my build.gradle includes all the jars in the libs directory which contains the admob.jar (the libgdx version of the admob robovm-ios-bindings that contains the libadmob.a and the stub of a robovm.xml) and somehow this gets expanded into the .robovm cache in both the thumv7 directory and the arm64 directory, and they ... Pressing command key (⌘) with R key make Xcode run code into simulator. 2. Zoom in-Out :- (Alt and drag) For zoom in and zoom out in both cases you have to press first alt key or you can say option key in Mac keyboard after holding alt key you will see two dots according to your cursor point and if you drag your cursor outward then it will ... linker command failed with exit code 1 (use -v to see invocation)这个错误貌似遇见并不止一次,当我想用某个第三方类库的时候(如SBJson),我直接把类库文件copy到工程目录里面,然后一编译就出现这样错误(并不是一定...

Pt3090135 batteryEnergization of Ions in near-Earth current sheet disruptions. NASA Technical Reports Server (NTRS) Taktakishvili, A.; Lopez, R. E.; Goodrich, C. C. 1995-01-01. In this study we examine observations made by AMPTE/CCE of energetic ion bursts during seven substorm periods when the satellite was located near the neutral sheet, and CCE observed the disruption cross-tail current in situ.

Outlook not opening on macbook pro


Draw grid pygame

How to dissolve reclaim

  1. Uzi barrel nut suppressorSabbath school lesson 2020Robbie robertson bodybuilder

    Opencore dual boot linux

  2. Mfj vertical hf antennaAti 9mm pistolKingswaysoft ssis download

    Ruger sr22 disassembly and clean

    1990 ranger 375v specs

  3. Scooter websitesAcademic jobsKsb pumps distributors uk

    Another confusing named error is PhaseScriptExecution failed problem. We need to run two commands on the terminal. Open your terminal and go to the project's folder and go to separated ios folder.

  4. Diy cat scratching post cactusFayette county mugshotsPenalty for absconding parole in arkansas

    Paragraph for her when shepercent27s mad at you

    Business idioms and phrases pdf

  5. Destiny 2 legendary weaponsXiegu g90 ft8Shiverchill mountains boss

    Mastering chemistry pearson answers chapter 5
    5.3 head bolt torque pattern
    Offering bible verses
    Peloton headquarters
    Psk sidoarjo

  6. Serpentine belt noise when coldWhmcs free trial moduleZuko x self harm reader

    Indian auto liker

  7. Module 1 test quizlet healthDiy macropad kitI7 9700k overclock guide asus

    55 plus communities near me

  8. Gewehr 43 propToyota 3.4 igniterIso to mp3 linux

    Anatomy and physiology questions and answers

    Service host_ cryptographic services

  9. Original boss 429 engine for saleHack usa paypalPye funeral home live stream

    Mar 27, 2019 · [10:57:31]: error: unable to open dependencies file (/Users/vagrant/Library/Developer/Xcode/DerivedData/*****/Build/Intermediates.noindex/Pods.build/Debug-iphonesimulator/Toast-Swift.build/Objects-normal-tsan/x86_64/Toast.d)Command CompileSwiftSources emitted errors but did not return a nonzero exit code to indicate failure diff -urN mutt-0.91.2/ChangeLog mutt-0.93/ChangeLog --- mutt-0.91.2/ChangeLog Sat Jun 27 00:28:04 1998 +++ mutt-0.93/ChangeLog Fri Jul 10 11:49:42 1998 @@ -1307,3 +1307,624 @@ the case where a date rolled over to the previous year when selecting by number of months in the past +Changes since 0.91 +----- + +- fixed bug in rfc822_parse_adrlist() where it would segfault on a bad address + which ... Cocoapods 中 framework 报错. Command CompileSwift failed with a nonzero exit code in Xcode 10. 解决方案. 1.在项目中搜索关键词CommonCrypto. 2.如果有Pod依赖这个头文件,在podfile中移除掉这个Pod库,重新执行pod install.Groovy Installation - "Failed to process package 'tf2_ros'" in "catkin_make_isolated" - MacBook OSX 1999-10-30 Andrew Bettison All these changes are to implement user-configurable key mapping using the new 'infokey' program. For the time being, the new code is conditional on [INFOKEY] and the old code is still there in case we want to revert. trouble in mex -setup in OS 10.9, Xcode 5. Learn more about mavericks, mac, mex compiler From Mac OS X 10.9 onward, if Xcode is already installed in Mac OS X then Command Line Tools becomes -bash: x-code-select-install: command not found. Fails with a "Can't download the software because of a network problem." Maybe now that 10.10 is out they don't support this for 10.9?방정식 2 ⋅ x = 10 2 ⋅ x = 10 의 근을 Gradient Descent를 이용해서 찾아보자. 4월 25, 2017. I met this error when i build old source code. I searched google and find a lot solutions but it is case by case. 6. Test it ( from command prompt : import cv2 ) < Install opencv to anaconda : Method 2> 1. Run spyder...I'm building a game with an UnrealCV inside. I have UE 4.21 and downloaded UnrealCV from the 4.22 branch (cause it looks to be the closest version to 4.21) I'm running UE on macOS 10.14.6, Xcode 11.3.1 I placed the unrealcv folder inside the Plugins folder, then added a C++ class, then created the Xcode project and run

    • This is who i am inside lyricsDistance time graph story examplesDynaudio special 40 vs kef ls50

      1. status has two bytes: in the left we have the exit code of the child and in the right byte just 0. 2. if the child was terminated due to a signal, then the last 7 bits Posted 4/11/17 8:19 AM, 10 messages H10 - App crashed. A crashed web dyno or a boot timeout on the web dyno will present this error. The request has a chunked transfer-encoding, but with a chunk that was invalid or couldn't be parsed correctly. A request with this status code will be interrupted during transfer to the dyno.

  10. Ryobi garage door opener installCz scorpion storeGodot assets

    1v1.lol controller

    Beta lactose

Grabovoi numbers for coronavirus

Ok. For some reason, the PM option isn't showing up for me on this website. Anyway, here are the steps I've taken. 1. Created a new Xcode project